Target
Cell division control protein 42 homolog
Ligand
BDBM50110164
Substrate
Meas. Tech.
Additional SAR compounds tested via Multiplex dose response to identify specific small molecule inhibitors of Ras and Ras-related GTPases specifically Cdc42 wildtype
EC50
30000±n/a nM
Citation
 PubChem, PC Additional SAR compounds tested via Multiplex dose response to identify specific small molecule inhibitors of Ras and Ras-related GTPases specifically Cdc42 wildtype PubChem Bioassay (2009)[AID] 
Target
Name:
Cell division control protein 42 homolog
Synonyms:
CDC42 Cell division control protein 42 homolog cell division cycle 42 (GTP binding protein, 25kDa)
Type:
PROTEIN
Mol. Mass.:
21258.36
Organism:
Homo sapiens (Human)
Description:
ChEMBL_652970
Residue:
191
  
Inhibitor
Name:
BDBM50110164
Synonyms:
(Z)-2-(3-(4-(methylthio)benzylidene)-6-fluoro-2-methyl-3H-inden-1-yl)acetic acid CHEMBL18797 Sulindac sulphide cid_5352624 {6-Fluoro-2-methyl-3-[1-[4-(methyl-lambda*4*-sulfanyl)-phenyl]-meth-(E)-ylidene]-3H-inden-1-yl}-acetic acid
Type:
Small organic molecule
Emp. Form.:
C20H17FO2S
Mol. Mass.:
340.411
SMILES:
CSc1ccc(\C=C2\C(C)=C(CC(O)=O)c3cc(F)ccc23)cc1
: