Target
Ras-related C3 botulinum toxin substrate 1
Ligand
BDBM54582
Substrate
Meas. Tech.
Oxadiazole SAR compounds tested via Multiplex dose response to identify specific small molecule inhibitors of Ras and Ras-related GTPases specifically Rac1 wildtype
EC50
2203±n/a nM
Citation
 PubChem, PC Oxadiazole SAR compounds tested via Multiplex dose response to identify specific small molecule inhibitors of Ras and Ras-related GTPases specifically Rac1 wildtype PubChem Bioassay (2009)[AID] 
Target
Name:
Ras-related C3 botulinum toxin substrate 1
Synonyms:
RAC1_MOUSE Rac1 protein
Type:
PROTEIN
Mol. Mass.:
21455.91
Organism:
Mus musculus
Description:
EBI_101485
Residue:
192
  
Inhibitor
Name:
BDBM54582
Synonyms:
1-[4-(2,5-dimethylphenyl)-1-piperazinyl]-3-[4-(4-methoxyphenyl)-2-oxazolyl]-1-propanone 1-[4-(2,5-dimethylphenyl)piperazino]-3-[4-(4-methoxyphenyl)oxazol-2-yl]propan-1-one UNM-0000306128 | cid_42628049
Type:
Small organic molecule
Emp. Form.:
C25H29N3O3
Mol. Mass.:
419.5161
SMILES:
COc1ccc(cc1)-c1coc(CCC(=O)N2CCN(CC2)c2cc(C)ccc2C)n1
: