Target
Ras-related protein Rab-7a
Ligand
BDBM54546
Substrate
Meas. Tech.
Oxadiazole SAR compounds tested via Multiplex dose response to identify specific small molecule inhibitors of Ras and Ras-related GTPases specifically Rab7 wildtype
EC50
14388±n/a nM
Citation
 PubChem, PC Oxadiazole SAR compounds tested via Multiplex dose response to identify specific small molecule inhibitors of Ras and Ras-related GTPases specifically Rab7 wildtype PubChem Bioassay (2009)[AID] 
Target
Name:
Ras-related protein Rab-7a
Synonyms:
GTP-binding protein (rab7) RAB7A | RAB7A_CANLF
Type:
Enzyme Catalytic Domain
Mol. Mass.:
23519.50
Organism:
Canis lupus familiaris
Description:
gi_164058
Residue:
207
  
Inhibitor
Name:
BDBM54546
Synonyms:
1-[4-(2,5-dimethylphenyl)-1-piperazinyl]-4-[3-(4-methoxyphenyl)-1,2,4-oxadiazol-5-yl]-1-butanone 1-[4-(2,5-dimethylphenyl)piperazino]-4-[3-(4-methoxyphenyl)-1,2,4-oxadiazol-5-yl]butan-1-one UNM-0000306067 | cid_25241703
Type:
Small organic molecule
Emp. Form.:
C25H30N4O3
Mol. Mass.:
434.5307
SMILES:
COc1ccc(cc1)-c1noc(CCCC(=O)N2CCN(CC2)c2cc(C)ccc2C)n1
: