Target
Ras-related protein Rab-7a
Ligand
BDBM54573
Substrate
Meas. Tech.
Oxadiazole SAR compounds tested via Multiplex dose response to identify specific small molecule inhibitors of Ras and Ras-related GTPases specifically Rab7 wildtype
EC50
30000±n/a nM
Citation
 PubChem, PC Oxadiazole SAR compounds tested via Multiplex dose response to identify specific small molecule inhibitors of Ras and Ras-related GTPases specifically Rab7 wildtype PubChem Bioassay (2009)[AID] 
Target
Name:
Ras-related protein Rab-7a
Synonyms:
GTP-binding protein (rab7) RAB7A | RAB7A_CANLF
Type:
Enzyme Catalytic Domain
Mol. Mass.:
23519.50
Organism:
Canis lupus familiaris
Description:
gi_164058
Residue:
207
  
Inhibitor
Name:
BDBM54573
Synonyms:
3-[3-(4-methoxyphenyl)-1,2,4-oxadiazol-5-yl]-1-[4-(2-methoxyphenyl)-1-piperazinyl]-1-propanone 3-[3-(4-methoxyphenyl)-1,2,4-oxadiazol-5-yl]-1-[4-(2-methoxyphenyl)piperazino]propan-1-one UNM-0000306117 | cid_15998789
Type:
Small organic molecule
Emp. Form.:
C23H26N4O4
Mol. Mass.:
422.4769
SMILES:
COc1ccc(cc1)-c1noc(CCC(=O)N2CCN(CC2)c2ccccc2OC)n1
: