Target
Ras-related protein Rab-7a
Ligand
BDBM54577
Substrate
Meas. Tech.
Oxadiazole SAR compounds tested via Multiplex dose response to identify specific small molecule inhibitors of Ras and Ras-related GTPases specifically Rab7 wildtype
EC50
30000±n/a nM
Citation
 PubChem, PC Oxadiazole SAR compounds tested via Multiplex dose response to identify specific small molecule inhibitors of Ras and Ras-related GTPases specifically Rab7 wildtype PubChem Bioassay (2009)[AID] 
Target
Name:
Ras-related protein Rab-7a
Synonyms:
GTP-binding protein (rab7) RAB7A | RAB7A_CANLF
Type:
Enzyme Catalytic Domain
Mol. Mass.:
23519.50
Organism:
Canis lupus familiaris
Description:
gi_164058
Residue:
207
  
Inhibitor
Name:
BDBM54577
Synonyms:
1-[4-(4-chlorophenyl)-1-piperazinyl]-3-[3-(4-methoxyphenyl)-1,2,4-oxadiazol-5-yl]-1-propanone 1-[4-(4-chlorophenyl)piperazino]-3-[3-(4-methoxyphenyl)-1,2,4-oxadiazol-5-yl]propan-1-one UNM-0000306121 | cid_20851567
Type:
Small organic molecule
Emp. Form.:
C22H23ClN4O3
Mol. Mass.:
426.896
SMILES:
COc1ccc(cc1)-c1noc(CCC(=O)N2CCN(CC2)c2ccc(Cl)cc2)n1
: