Target
Ras-related protein Rab-2A
Ligand
BDBM54551
Substrate
Meas. Tech.
Oxadiazole SAR compounds tested via Multiplex dose response to identify specific small molecule inhibitors of Ras and Ras-related GTPases specifically Rab2 wildtype
EC50
2938±n/a nM
Citation
 PubChem, PC Oxadiazole SAR compounds tested via Multiplex dose response to identify specific small molecule inhibitors of Ras and Ras-related GTPases specifically Rab2 wildtype PubChem Bioassay (2009)[AID] 
Target
Name:
Ras-related protein Rab-2A
Synonyms:
RAB2 RAB2A_CANLF | Ras-related protein Rab-2A.
Type:
Enzyme Catalytic Domain
Mol. Mass.:
23545.28
Organism:
Canis lupus familiaris
Description:
gi_46577642
Residue:
212
  
Inhibitor
Name:
BDBM54551
Synonyms:
3-[3-(4-bromophenyl)-1,2,4-oxadiazol-5-yl]-1-[4-(2,5-dimethylphenyl)-1-piperazinyl]-1-propanone 3-[3-(4-bromophenyl)-1,2,4-oxadiazol-5-yl]-1-[4-(2,5-dimethylphenyl)piperazino]propan-1-one UNM-0000306072 | cid_25241708
Type:
Small organic molecule
Emp. Form.:
C23H25BrN4O2
Mol. Mass.:
469.374
SMILES:
Cc1ccc(C)c(c1)N1CCN(CC1)C(=O)CCc1nc(no1)-c1ccc(Br)cc1
: