Target
Ras-related protein Rab-2A
Ligand
BDBM54559
Substrate
Meas. Tech.
Oxadiazole SAR compounds tested via Multiplex dose response to identify specific small molecule inhibitors of Ras and Ras-related GTPases specifically Rab2 wildtype
Ki
210±n/a nM
Citation
 PubChem, PC Oxadiazole SAR compounds tested via Multiplex dose response to identify specific small molecule inhibitors of Ras and Ras-related GTPases specifically Rab2 wildtype PubChem Bioassay (2009)[AID] 
Target
Name:
Ras-related protein Rab-2A
Synonyms:
RAB2 RAB2A_CANLF | Ras-related protein Rab-2A.
Type:
Enzyme Catalytic Domain
Mol. Mass.:
23545.28
Organism:
Canis lupus familiaris
Description:
gi_46577642
Residue:
212
  
Inhibitor
Name:
BDBM54559
Synonyms:
1-[4-(2-bromophenyl)-1-piperazinyl]-3-[3-(4-methoxyphenyl)-1,2,4-oxadiazol-5-yl]-1-propanone 1-[4-(2-bromophenyl)piperazino]-3-[3-(4-methoxyphenyl)-1,2,4-oxadiazol-5-yl]propan-1-one UNM-0000306080 | cid_42596907
Type:
Small organic molecule
Emp. Form.:
C22H23BrN4O3
Mol. Mass.:
471.347
SMILES:
COc1ccc(cc1)-c1noc(CCC(=O)N2CCN(CC2)c2ccccc2Br)n1
: