Target
Ras-related protein Rab-7a
Ligand
BDBM54696
Substrate
Meas. Tech.
Additional SAR compounds tested via Multiplex dose response to identify specific small molecule inhibitors of Ras and Ras-related GTPases specifically Rab7 wildtype
EC50
30000±n/a nM
Citation
 PubChem, PC Additional SAR compounds tested via Multiplex dose response to identify specific small molecule inhibitors of Ras and Ras-related GTPases specifically Rab7 wildtype PubChem Bioassay (2009)[AID] 
Target
Name:
Ras-related protein Rab-7a
Synonyms:
GTP-binding protein (rab7) RAB7A | RAB7A_CANLF
Type:
Enzyme Catalytic Domain
Mol. Mass.:
23519.50
Organism:
Canis lupus familiaris
Description:
gi_164058
Residue:
207
  
Inhibitor
Name:
BDBM54696
Synonyms:
1-nitro-4-(2-phenylethynyl)benzene cid_3560757
Type:
Small organic molecule
Emp. Form.:
C14H9NO2
Mol. Mass.:
223.2268
SMILES:
[O-][N+](=O)c1ccc(cc1)C#Cc1ccccc1
: