Target
Ras-related protein Rab-7a
Ligand
BDBM54707
Substrate
Meas. Tech.
Additional SAR compounds tested via Multiplex dose response to identify specific small molecule inhibitors of Ras and Ras-related GTPases specifically Rab7 wildtype
EC50
30000±n/a nM
Citation
 PubChem, PC Additional SAR compounds tested via Multiplex dose response to identify specific small molecule inhibitors of Ras and Ras-related GTPases specifically Rab7 wildtype PubChem Bioassay (2009)[AID] 
Target
Name:
Ras-related protein Rab-7a
Synonyms:
GTP-binding protein (rab7) RAB7A | RAB7A_CANLF
Type:
Enzyme Catalytic Domain
Mol. Mass.:
23519.50
Organism:
Canis lupus familiaris
Description:
gi_164058
Residue:
207
  
Inhibitor
Name:
BDBM54707
Synonyms:
2-[(3E)-6-fluoranyl-2-methyl-3-[(4-methylsulfinylphenyl)methylidene]inden-1-yl]ethanoic acid 2-[(3E)-6-fluoro-2-methyl-3-[(4-methylsulfinylphenyl)methylidene]-1-indenyl]acetic acid UNM-0000306136 | cid_1548885
Type:
Small organic molecule
Emp. Form.:
C20H17FO3S
Mol. Mass.:
356.411
SMILES:
CC1=C(CC(O)=O)c2cc(F)ccc2\C1=C\c1ccc(cc1)S(C)=O
: