Target
Cell division control protein 42 homolog
Ligand
BDBM48386
Substrate
Meas. Tech.
Oxadiazole SAR compounds tested via Multiplex dose response to identify specific small molecule inhibitors of Ras and Ras-related GTPases specifically Cdc42 wildtype
EC50
1919±n/a nM
Citation
 PubChem, PC Oxadiazole SAR compounds tested via Multiplex dose response to identify specific small molecule inhibitors of Ras and Ras-related GTPases specifically Cdc42 wildtype PubChem Bioassay (2009)[AID] 
Target
Name:
Cell division control protein 42 homolog
Synonyms:
CDC42 Cell division control protein 42 homolog cell division cycle 42 (GTP binding protein, 25kDa)
Type:
PROTEIN
Mol. Mass.:
21258.36
Organism:
Homo sapiens (Human)
Description:
ChEMBL_652970
Residue:
191
  
Inhibitor
Name:
BDBM48386
Synonyms:
1-{3-[3-(4-methoxyphenyl)-1,2,4-oxadiazol-5-yl]propanoyl}-4-[3-(trifluoromethyl)phenyl]piperazine 3-[3-(4-methoxyphenyl)-1,2,4-oxadiazol-5-yl]-1-[4-[3-(trifluoromethyl)phenyl]piperazin-1-yl]propan-1-one MLS000091368 cid_3243472
Type:
Small organic molecule
Emp. Form.:
C23H23F3N4O3
Mol. Mass.:
460.4489
SMILES:
COc1ccc(cc1)-c1noc(CCC(=O)N2CCN(CC2)c2cccc(c2)C(F)(F)F)n1
: