Target
GTPase KRas [1-37]
Ligand
BDBM54701
Substrate
Meas. Tech.
Additional SAR compounds tested via Multiplex dose response to identify specific small molecule inhibitors of Ras and Ras-related GTPases specifically Ras wildtype
EC50
30974±n/a nM
Citation
 PubChem, PC Additional SAR compounds tested via Multiplex dose response to identify specific small molecule inhibitors of Ras and Ras-related GTPases specifically Ras wildtype PubChem Bioassay (2009)[AID] 
Target
Name:
GTPase KRas [1-37]
Synonyms:
ras protein
Type:
Enzyme Catalytic Domain
Mol. Mass.:
4034.04
Organism:
Homo sapiens (Human)
Description:
gi_190938
Residue:
37
  
Inhibitor
Name:
BDBM54701
Synonyms:
1-(4-fluorophenyl)-3-phenyl-2-propyn-1-one 1-(4-fluorophenyl)-3-phenylprop-2-yn-1-one cid_13200052
Type:
Small organic molecule
Emp. Form.:
C15H9FO
Mol. Mass.:
224.2298
SMILES:
Fc1ccc(cc1)C(=O)C#Cc1ccccc1
: