Target
GTPase KRas [1-37]
Ligand
BDBM22360
Substrate
Meas. Tech.
Additional SAR compounds tested via Multiplex dose response to identify specific small molecule inhibitors of Ras and Ras-related GTPases specifically Ras wildtype
EC50
30000±n/a nM
Citation
 PubChem, PC Additional SAR compounds tested via Multiplex dose response to identify specific small molecule inhibitors of Ras and Ras-related GTPases specifically Ras wildtype PubChem Bioassay (2009)[AID] 
Target
Name:
GTPase KRas [1-37]
Synonyms:
ras protein
Type:
Enzyme Catalytic Domain
Mol. Mass.:
4034.04
Organism:
Homo sapiens (Human)
Description:
gi_190938
Residue:
37
  
Inhibitor
Name:
BDBM22360
Synonyms:
2-(acetyloxy)benzoate Acetylsalicylic acid Endosprin Zorprin cid_2244
Type:
Anti-Inflammatory Agents, Non-Steroidal
Emp. Form.:
C9H8O4
Mol. Mass.:
180.1574
SMILES:
CC(=O)Oc1ccccc1C(O)=O
: