Target
Ras-related C3 botulinum toxin substrate 1
Ligand
BDBM54684
Substrate
Meas. Tech.
Additional SAR compounds tested via Multiplex dose response to identify specific small molecule inhibitors of Ras and Ras-related GTPases specifically Rac1 activated mutant
EC50
30000±n/a nM
Citation
 PubChem, PC Additional SAR compounds tested via Multiplex dose response to identify specific small molecule inhibitors of Ras and Ras-related GTPases specifically Rac1 activated mutant PubChem Bioassay (2009)[AID] 
Target
Name:
Ras-related C3 botulinum toxin substrate 1
Synonyms:
RAC1_MOUSE Rac1 protein
Type:
PROTEIN
Mol. Mass.:
21455.91
Organism:
Mus musculus
Description:
EBI_101485
Residue:
192
  
Inhibitor
Name:
BDBM54684
Synonyms:
7-chloranyl-3-[3-(oxidanylamino)-1H-indol-2-yl]indol-2-one 7-chloro-3-[3-(hydroxyamino)-1H-indol-2-yl]indol-2-one cid_11845976
Type:
Small organic molecule
Emp. Form.:
C16H10ClN3O2
Mol. Mass.:
311.723
SMILES:
ONc1c([nH]c2ccccc12)C1=c2cccc(Cl)c2=NC1=O
: