Target
Ras-related C3 botulinum toxin substrate 1
Ligand
BDBM54685
Substrate
Meas. Tech.
Additional SAR compounds tested via Multiplex dose response to identify specific small molecule inhibitors of Ras and Ras-related GTPases specifically Rac1 wildtype
EC50
30000±n/a nM
Citation
 PubChem, PC Additional SAR compounds tested via Multiplex dose response to identify specific small molecule inhibitors of Ras and Ras-related GTPases specifically Rac1 wildtype PubChem Bioassay (2009)[AID] 
Target
Name:
Ras-related C3 botulinum toxin substrate 1
Synonyms:
RAC1_MOUSE Rac1 protein
Type:
PROTEIN
Mol. Mass.:
21455.91
Organism:
Mus musculus
Description:
EBI_101485
Residue:
192
  
Inhibitor
Name:
BDBM54685
Synonyms:
7-bromanyl-3-[3-(oxidanylamino)-1H-indol-2-yl]indol-2-one 7-bromo-3-[3-(hydroxyamino)-1H-indol-2-yl]indol-2-one cid_11846148
Type:
Small organic molecule
Emp. Form.:
C16H10BrN3O2
Mol. Mass.:
356.174
SMILES:
ONc1c([nH]c2ccccc12)C1=c2cccc(Br)c2=NC1=O
: