Target
Ras-related C3 botulinum toxin substrate 1
Ligand
BDBM54701
Substrate
Meas. Tech.
Additional SAR compounds tested via Multiplex dose response to identify specific small molecule inhibitors of Ras and Ras-related GTPases specifically Rac1 wildtype
EC50
30000±n/a nM
Citation
 PubChem, PC Additional SAR compounds tested via Multiplex dose response to identify specific small molecule inhibitors of Ras and Ras-related GTPases specifically Rac1 wildtype PubChem Bioassay (2009)[AID] 
Target
Name:
Ras-related C3 botulinum toxin substrate 1
Synonyms:
RAC1_MOUSE Rac1 protein
Type:
PROTEIN
Mol. Mass.:
21455.91
Organism:
Mus musculus
Description:
EBI_101485
Residue:
192
  
Inhibitor
Name:
BDBM54701
Synonyms:
1-(4-fluorophenyl)-3-phenyl-2-propyn-1-one 1-(4-fluorophenyl)-3-phenylprop-2-yn-1-one cid_13200052
Type:
Small organic molecule
Emp. Form.:
C15H9FO
Mol. Mass.:
224.2298
SMILES:
Fc1ccc(cc1)C(=O)C#Cc1ccccc1
: