Target
Ras-related C3 botulinum toxin substrate 1
Ligand
BDBM54689
Substrate
Meas. Tech.
Additional SAR compounds tested via Multiplex dose response to identify specific small molecule inhibitors of Ras and Ras-related GTPases specifically Rac1 wildtype
Ki
920±n/a nM
Citation
 PubChem, PC Additional SAR compounds tested via Multiplex dose response to identify specific small molecule inhibitors of Ras and Ras-related GTPases specifically Rac1 wildtype PubChem Bioassay (2009)[AID] 
Target
Name:
Ras-related C3 botulinum toxin substrate 1
Synonyms:
RAC1_MOUSE Rac1 protein
Type:
PROTEIN
Mol. Mass.:
21455.91
Organism:
Mus musculus
Description:
EBI_101485
Residue:
192
  
Inhibitor
Name:
BDBM54689
Synonyms:
2-amino-5-benzoyl-4-(5-bromo-3-pyridinyl)-1-(4-methoxyphenyl)sulfonyl-3-pyrrolecarbonitrile 2-amino-5-benzoyl-4-(5-bromopyridin-3-yl)-1-(4-methoxyphenyl)sulfonylpyrrole-3-carbonitrile UNM-0000305779 | cid_25220930
Type:
Small organic molecule
Emp. Form.:
C24H17BrN4O4S
Mol. Mass.:
537.385
SMILES:
COc1ccc(cc1)S(=O)(=O)n1c(N)c(C#N)c(c1C(=O)c1ccccc1)-c1cncc(Br)c1
: