Target
Ras-related protein Rab-7a
Ligand
BDBM54627
Substrate
Meas. Tech.
Pyrazoline SAR compounds tested via Multiplex dose response to identify specific small molecule inhibitors of Ras and Ras-related GTPases specifically Rab7 wildtype
EC50
30000±n/a nM
Citation
 PubChem, PC Pyrazoline SAR compounds tested via Multiplex dose response to identify specific small molecule inhibitors of Ras and Ras-related GTPases specifically Rab7 wildtype PubChem Bioassay (2009)[AID] 
Target
Name:
Ras-related protein Rab-7a
Synonyms:
GTP-binding protein (rab7) RAB7A | RAB7A_CANLF
Type:
Enzyme Catalytic Domain
Mol. Mass.:
23519.50
Organism:
Canis lupus familiaris
Description:
gi_164058
Residue:
207
  
Inhibitor
Name:
BDBM54627
Synonyms:
4-[5-(4-fluorophenyl)-2-phenyl-3,4-dihydropyrazol-3-yl]-N,N-dimethyl-aniline UNM-0000305866 cid_2932251
Type:
Small organic molecule
Emp. Form.:
C23H22FN3
Mol. Mass.:
359.4393
SMILES:
CN(C)c1ccc(cc1)C1CC(=NN1c1ccccc1)c1ccc(F)cc1
: