Target
Ras-related protein Rab-7a
Ligand
BDBM54628
Substrate
Meas. Tech.
Pyrazoline SAR compounds tested via Multiplex dose response to identify specific small molecule inhibitors of Ras and Ras-related GTPases specifically Rab7 wildtype
EC50
30000±n/a nM
Citation
 PubChem, PC Pyrazoline SAR compounds tested via Multiplex dose response to identify specific small molecule inhibitors of Ras and Ras-related GTPases specifically Rab7 wildtype PubChem Bioassay (2009)[AID] 
Target
Name:
Ras-related protein Rab-7a
Synonyms:
GTP-binding protein (rab7) RAB7A | RAB7A_CANLF
Type:
Enzyme Catalytic Domain
Mol. Mass.:
23519.50
Organism:
Canis lupus familiaris
Description:
gi_164058
Residue:
207
  
Inhibitor
Name:
BDBM54628
Synonyms:
3-(4-fluorophenyl)-5-(3-nitrophenyl)-1-phenyl-2-pyrazoline UNM-0000305867 | cid_2933589
Type:
Small organic molecule
Emp. Form.:
C21H16FN3O2
Mol. Mass.:
361.369
SMILES:
[O-][N+](=O)c1cccc(c1)C1C[C-](N=[N+]1c1ccccc1)c1ccc(F)cc1
: