Target
Ras-related protein Rab-7a
Ligand
BDBM54634
Substrate
Meas. Tech.
Pyrazoline SAR compounds tested via Multiplex dose response to identify specific small molecule inhibitors of Ras and Ras-related GTPases specifically Rab7 wildtype
EC50
30000±n/a nM
Citation
 PubChem, PC Pyrazoline SAR compounds tested via Multiplex dose response to identify specific small molecule inhibitors of Ras and Ras-related GTPases specifically Rab7 wildtype PubChem Bioassay (2009)[AID] 
Target
Name:
Ras-related protein Rab-7a
Synonyms:
GTP-binding protein (rab7) RAB7A | RAB7A_CANLF
Type:
Enzyme Catalytic Domain
Mol. Mass.:
23519.50
Organism:
Canis lupus familiaris
Description:
gi_164058
Residue:
207
  
Inhibitor
Name:
BDBM54634
Synonyms:
4-[5-(4-methoxyphenyl)-3-phenyl-1-pyrazolyl]benzenesulfonamide 4-[5-(4-methoxyphenyl)-3-phenylpyrazol-1-yl]benzenesulfonamide UNM-0000306108 | cid_14199398
Type:
Small organic molecule
Emp. Form.:
C22H19N3O3S
Mol. Mass.:
405.47
SMILES:
COc1ccc(cc1)-c1cc(nn1-c1ccc(cc1)S(N)(=O)=O)-c1ccccc1
: