Target
Ras-related protein Rab-7a
Ligand
BDBM54665
Substrate
Meas. Tech.
Pyrazoline SAR compounds tested via Multiplex dose response to identify specific small molecule inhibitors of Ras and Ras-related GTPases specifically Rab7 wildtype
EC50
30000±n/a nM
Citation
 PubChem, PC Pyrazoline SAR compounds tested via Multiplex dose response to identify specific small molecule inhibitors of Ras and Ras-related GTPases specifically Rab7 wildtype PubChem Bioassay (2009)[AID] 
Target
Name:
Ras-related protein Rab-7a
Synonyms:
GTP-binding protein (rab7) RAB7A | RAB7A_CANLF
Type:
Enzyme Catalytic Domain
Mol. Mass.:
23519.50
Organism:
Canis lupus familiaris
Description:
gi_164058
Residue:
207
  
Inhibitor
Name:
BDBM54665
Synonyms:
4-[3-(2-chlorophenyl)-5-phenyl-3,4-dihydropyrazol-2-yl]benzenesulfonamide KUC103446N cid_44193697
Type:
Small organic molecule
Emp. Form.:
C21H18ClN3O2S
Mol. Mass.:
411.905
SMILES:
NS(=O)(=O)c1ccc(cc1)N1N=C(CC1c1ccccc1Cl)c1ccccc1
: