Target
Ras-related protein Rab-7a
Ligand
BDBM54670
Substrate
Meas. Tech.
Pyrazoline SAR compounds tested via Multiplex dose response to identify specific small molecule inhibitors of Ras and Ras-related GTPases specifically Rab7 wildtype
EC50
30000±n/a nM
Citation
 PubChem, PC Pyrazoline SAR compounds tested via Multiplex dose response to identify specific small molecule inhibitors of Ras and Ras-related GTPases specifically Rab7 wildtype PubChem Bioassay (2009)[AID] 
Target
Name:
Ras-related protein Rab-7a
Synonyms:
GTP-binding protein (rab7) RAB7A | RAB7A_CANLF
Type:
Enzyme Catalytic Domain
Mol. Mass.:
23519.50
Organism:
Canis lupus familiaris
Description:
gi_164058
Residue:
207
  
Inhibitor
Name:
BDBM54670
Synonyms:
4-[3-(4-methoxyphenyl)-5-(3-pyridinyl)-3,4-dihydropyrazol-2-yl]benzenesulfonamide 4-[5-(4-methoxyphenyl)-3-(3-pyridyl)-2-pyrazolin-1-yl]benzenesulfonamide cid_44216840
Type:
Small organic molecule
Emp. Form.:
C21H20N4O3S
Mol. Mass.:
408.473
SMILES:
COc1ccc(cc1)C1CC(=NN1c1ccc(cc1)S(N)(=O)=O)c1cccnc1
: