Target
GTPase KRas [1-37]
Ligand
BDBM54712
Substrate
Meas. Tech.
Oxadiazole SAR compounds tested via Multiplex dose response to identify specific small molecule inhibitors of Ras and Ras-related GTPases specifically Ras activated mutant
EC50
30000±n/a nM
Citation
 PubChem, PC Oxadiazole SAR compounds tested via Multiplex dose response to identify specific small molecule inhibitors of Ras and Ras-related GTPases specifically Ras activated mutant PubChem Bioassay (2009)[AID] 
Target
Name:
GTPase KRas [1-37]
Synonyms:
ras protein
Type:
Enzyme Catalytic Domain
Mol. Mass.:
4034.04
Organism:
Homo sapiens (Human)
Description:
gi_190938
Residue:
37
  
Inhibitor
Name:
BDBM54712
Synonyms:
1-[4-(2,5-dimethylphenyl)-1-piperazinyl]-3-[5-(4-methoxyphenyl)-2-furanyl]-1-propanone 1-[4-(2,5-dimethylphenyl)piperazino]-3-[5-(4-methoxyphenyl)-2-furyl]propan-1-one UNM-0000306164 | cid_44193698
Type:
Small organic molecule
Emp. Form.:
C26H30N2O3
Mol. Mass.:
418.528
SMILES:
COc1ccc(cc1)-c1ccc(CCC(=O)N2CCN(CC2)c2cc(C)ccc2C)o1
: