Target
GTPase KRas [1-37]
Ligand
BDBM54686
Substrate
Meas. Tech.
Additional SAR compounds tested via Multiplex dose response to identify specific small molecule inhibitors of Ras and Ras-related GTPases specifically Ras activated mutant
EC50
35±n/a nM
Comments
Extracted from aid = 2043 and tid = 2
Citation
 PubChem, PC Additional SAR compounds tested via Multiplex dose response to identify specific small molecule inhibitors of Ras and Ras-related GTPases specifically Ras activated mutant PubChem Bioassay (2009)[AID] 
Target
Name:
GTPase KRas [1-37]
Synonyms:
ras protein
Type:
Enzyme Catalytic Domain
Mol. Mass.:
4034.04
Organism:
Homo sapiens (Human)
Description:
gi_190938
Residue:
37
  
Inhibitor
Name:
BDBM54686
Synonyms:
2-amino-5-benzoyl-4-(3-bromo-4-methoxy-phenyl)-1-mesyl-pyrrole-3-carbonitrile 2-amino-5-benzoyl-4-(3-bromo-4-methoxyphenyl)-1-methylsulfonylpyrrole-3-carbonitrile UNM-0000305776 | cid_25220927
Type:
Small organic molecule
Emp. Form.:
C20H16BrN3O4S
Mol. Mass.:
474.328
SMILES:
COc1ccc(cc1Br)-c1c(C#N)c(N)n(c1C(=O)c1ccccc1)S(C)(=O)=O
: