Target
GTPase KRas [1-37]
Ligand
BDBM54690
Substrate
Meas. Tech.
Additional SAR compounds tested via Multiplex dose response to identify specific small molecule inhibitors of Ras and Ras-related GTPases specifically Ras activated mutant
EC50
30000±n/a nM
Comments
Extracted from aid = 2043 and tid = 2
Citation
 PubChem, PC Additional SAR compounds tested via Multiplex dose response to identify specific small molecule inhibitors of Ras and Ras-related GTPases specifically Ras activated mutant PubChem Bioassay (2009)[AID] 
Target
Name:
GTPase KRas [1-37]
Synonyms:
ras protein
Type:
Enzyme Catalytic Domain
Mol. Mass.:
4034.04
Organism:
Homo sapiens (Human)
Description:
gi_190938
Residue:
37
  
Inhibitor
Name:
BDBM54690
Synonyms:
2-amino-5-benzoyl-4-(4-chlorophenyl)-1-(4-nitrophenyl)sulfonyl-3-pyrrolecarbonitrile 2-amino-5-benzoyl-4-(4-chlorophenyl)-1-nosyl-pyrrole-3-carbonitrile UNM-0000305780 | cid_25220931
Type:
Small organic molecule
Emp. Form.:
C24H15ClN4O5S
Mol. Mass.:
506.918
SMILES:
Nc1c(C#N)c(c(C(=O)c2ccccc2)n1S(=O)(=O)c1ccc(cc1)[N+]([O-])=O)-c1ccc(Cl)cc1
: