Target
Ras-related protein Rab-2A
Ligand
BDBM54619
Substrate
Meas. Tech.
Pyrazoline SAR compounds tested via Multiplex dose response to identify specific small molecule inhibitors of Ras and Ras-related GTPases specifically Rab2 wildtype
EC50
30000±n/a nM
Comments
Extracted from aid = 2045 and tid = 2
Citation
 PubChem, PC Pyrazoline SAR compounds tested via Multiplex dose response to identify specific small molecule inhibitors of Ras and Ras-related GTPases specifically Rab2 wildtype PubChem Bioassay (2016)[AID] 
Target
Name:
Ras-related protein Rab-2A
Synonyms:
RAB2 RAB2A_CANLF | Ras-related protein Rab-2A.
Type:
Enzyme Catalytic Domain
Mol. Mass.:
23545.28
Organism:
Canis lupus familiaris
Description:
gi_46577642
Residue:
212
  
Inhibitor
Name:
BDBM54619
Synonyms:
3-(4-chlorophenyl)-5-(3,4-dimethoxyphenyl)-1-phenyl-2-pyrazoline UNM-0000305858 | cid_2883031
Type:
Small organic molecule
Emp. Form.:
C23H21ClN2O2
Mol. Mass.:
392.878
SMILES:
COc1ccc(cc1OC)C1CC(=NN1c1ccccc1)c1ccc(Cl)cc1
: