Target
Ras-related protein Rab-2A
Ligand
BDBM54620
Substrate
Meas. Tech.
Pyrazoline SAR compounds tested via Multiplex dose response to identify specific small molecule inhibitors of Ras and Ras-related GTPases specifically Rab2 wildtype
EC50
30000±n/a nM
Comments
Extracted from aid = 2045 and tid = 2
Citation
 PubChem, PC Pyrazoline SAR compounds tested via Multiplex dose response to identify specific small molecule inhibitors of Ras and Ras-related GTPases specifically Rab2 wildtype PubChem Bioassay (2016)[AID] 
Target
Name:
Ras-related protein Rab-2A
Synonyms:
RAB2 RAB2A_CANLF | Ras-related protein Rab-2A.
Type:
Enzyme Catalytic Domain
Mol. Mass.:
23545.28
Organism:
Canis lupus familiaris
Description:
gi_46577642
Residue:
212
  
Inhibitor
Name:
BDBM54620
Synonyms:
3-(2-chlorophenyl)-5-(4-chlorophenyl)-2-[3-(trifluoromethyl)phenyl]-3,4-dihydropyrazole UNM-0000305859 | cid_2883040
Type:
Small organic molecule
Emp. Form.:
C22H15Cl2F3N2
Mol. Mass.:
435.269
SMILES:
FC(F)(F)c1cccc(c1)N1N=C(CC1c1ccccc1Cl)c1ccc(Cl)cc1
: