Target
Ras-related protein Rab-2A
Ligand
BDBM54647
Substrate
Meas. Tech.
Pyrazoline SAR compounds tested via Multiplex dose response to identify specific small molecule inhibitors of Ras and Ras-related GTPases specifically Rab2 wildtype
EC50
30000±n/a nM
Comments
Extracted from aid = 2045 and tid = 2
Citation
 PubChem, PC Pyrazoline SAR compounds tested via Multiplex dose response to identify specific small molecule inhibitors of Ras and Ras-related GTPases specifically Rab2 wildtype PubChem Bioassay (2016)[AID] 
Target
Name:
Ras-related protein Rab-2A
Synonyms:
RAB2 RAB2A_CANLF | Ras-related protein Rab-2A.
Type:
Enzyme Catalytic Domain
Mol. Mass.:
23545.28
Organism:
Canis lupus familiaris
Description:
gi_46577642
Residue:
212
  
Inhibitor
Name:
BDBM54647
Synonyms:
4-[3-(4-methylphenyl)-5-phenyl-3,4-dihydropyrazol-2-yl]benzenesulfonamide KUC103423N cid_13927310
Type:
Small organic molecule
Emp. Form.:
C22H21N3O2S
Mol. Mass.:
391.486
SMILES:
Cc1ccc(cc1)C1CC(=NN1c1ccc(cc1)S(N)(=O)=O)c1ccccc1
: