Target
Ras-related protein Rab-2A
Ligand
BDBM43263
Substrate
Meas. Tech.
Additional SAR compounds tested via Multiplex dose response to identify specific small molecule inhibitors of Ras and Ras-related GTPases specifically Rab2 wildtype
EC50
30000±n/a nM
Citation
 PubChem, PC Additional SAR compounds tested via Multiplex dose response to identify specific small molecule inhibitors of Ras and Ras-related GTPases specifically Rab2 wildtype PubChem Bioassay (2009)[AID] 
Target
Name:
Ras-related protein Rab-2A
Synonyms:
RAB2 RAB2A_CANLF | Ras-related protein Rab-2A.
Type:
Enzyme Catalytic Domain
Mol. Mass.:
23545.28
Organism:
Canis lupus familiaris
Description:
gi_46577642
Residue:
212
  
Inhibitor
Name:
BDBM43263
Synonyms:
1-(4-nitrophenyl)-3-phenyl-2-propyn-1-one 1-(4-nitrophenyl)-3-phenylprop-2-yn-1-one SMR000142713 | cid_891179
Type:
Small organic molecule
Emp. Form.:
C15H9NO3
Mol. Mass.:
251.2369
SMILES:
[O-][N+](=O)c1ccc(cc1)C(=O)C#Cc1ccccc1
: