Target
Ras-related protein Rab-2A
Ligand
BDBM50110164
Substrate
Meas. Tech.
Additional SAR compounds tested via Multiplex dose response to identify specific small molecule inhibitors of Ras and Ras-related GTPases specifically Rab2 wildtype
EC50
30000±n/a nM
Citation
 PubChem, PC Additional SAR compounds tested via Multiplex dose response to identify specific small molecule inhibitors of Ras and Ras-related GTPases specifically Rab2 wildtype PubChem Bioassay (2009)[AID] 
Target
Name:
Ras-related protein Rab-2A
Synonyms:
RAB2 RAB2A_CANLF | Ras-related protein Rab-2A.
Type:
Enzyme Catalytic Domain
Mol. Mass.:
23545.28
Organism:
Canis lupus familiaris
Description:
gi_46577642
Residue:
212
  
Inhibitor
Name:
BDBM50110164
Synonyms:
(Z)-2-(3-(4-(methylthio)benzylidene)-6-fluoro-2-methyl-3H-inden-1-yl)acetic acid CHEMBL18797 Sulindac sulphide cid_5352624 {6-Fluoro-2-methyl-3-[1-[4-(methyl-lambda*4*-sulfanyl)-phenyl]-meth-(E)-ylidene]-3H-inden-1-yl}-acetic acid
Type:
Small organic molecule
Emp. Form.:
C20H17FO2S
Mol. Mass.:
340.411
SMILES:
CSc1ccc(\C=C2\C(C)=C(CC(O)=O)c3cc(F)ccc23)cc1
: