Target
GTPase KRas [1-37]
Ligand
BDBM54656
Substrate
Meas. Tech.
Pyrazoline SAR compounds tested via Multiplex dose response to identify specific small molecule inhibitors of Ras and Ras-related GTPases specifically Ras wildtype
EC50
30000±n/a nM
Citation
 PubChem, PC Pyrazoline SAR compounds tested via Multiplex dose response to identify specific small molecule inhibitors of Ras and Ras-related GTPases specifically Ras wildtype PubChem Bioassay (2009)[AID] 
Target
Name:
GTPase KRas [1-37]
Synonyms:
ras protein
Type:
Enzyme Catalytic Domain
Mol. Mass.:
4034.04
Organism:
Homo sapiens (Human)
Description:
gi_190938
Residue:
37
  
Inhibitor
Name:
BDBM54656
Synonyms:
4-[3-(4-methoxyphenyl)-5-(4-methylphenyl)-3,4-dihydropyrazol-2-yl]benzenesulfonamide KUC103418N cid_15201821
Type:
Small organic molecule
Emp. Form.:
C23H23N3O3S
Mol. Mass.:
421.512
SMILES:
COc1ccc(cc1)C1CC(=NN1c1ccc(cc1)S(N)(=O)=O)c1ccc(C)cc1
: