Target
Ras-related C3 botulinum toxin substrate 1
Ligand
BDBM54651
Substrate
Meas. Tech.
Pyrazoline SAR compounds tested via Multiplex dose response to identify specific small molecule inhibitors of Ras and Ras-related GTPases specifically Rac1 activated mutant
EC50
30000±n/a nM
Citation
 PubChem, PC Pyrazoline SAR compounds tested via Multiplex dose response to identify specific small molecule inhibitors of Ras and Ras-related GTPases specifically Rac1 activated mutant PubChem Bioassay (2009)[AID] 
Target
Name:
Ras-related C3 botulinum toxin substrate 1
Synonyms:
RAC1_MOUSE Rac1 protein
Type:
PROTEIN
Mol. Mass.:
21455.91
Organism:
Mus musculus
Description:
EBI_101485
Residue:
192
  
Inhibitor
Name:
BDBM54651
Synonyms:
4-(3,5-diphenyl-2-pyrazolin-1-yl)benzenesulfonamide KUC103427N cid_2837695
Type:
Small organic molecule
Emp. Form.:
C21H19N3O2S
Mol. Mass.:
377.459
SMILES:
NS(=O)(=O)c1ccc(cc1)N1N=C(CC1c1ccccc1)c1ccccc1
: