Target
Ras-related C3 botulinum toxin substrate 1
Ligand
BDBM54594
Substrate
Meas. Tech.
Pyrazoline SAR compounds tested via Multiplex dose response to identify specific small molecule inhibitors of Ras and Ras-related GTPases specifically Rac1 activated mutant
Ki
60±n/a nM
Citation
 PubChem, PC Pyrazoline SAR compounds tested via Multiplex dose response to identify specific small molecule inhibitors of Ras and Ras-related GTPases specifically Rac1 activated mutant PubChem Bioassay (2009)[AID] 
Target
Name:
Ras-related C3 botulinum toxin substrate 1
Synonyms:
RAC1_MOUSE Rac1 protein
Type:
PROTEIN
Mol. Mass.:
21455.91
Organism:
Mus musculus
Description:
EBI_101485
Residue:
192
  
Inhibitor
Name:
BDBM54594
Synonyms:
3-(4-bromophenyl)-1-(2-chlorophenyl)-5-(4-methoxyphenyl)-2-pyrazoline UNM-0000305832 | cid_2830691
Type:
Small organic molecule
Emp. Form.:
C22H18BrClN2O
Mol. Mass.:
441.748
SMILES:
COc1ccc(cc1)C1CC(=NN1c1ccccc1Cl)c1ccc(Br)cc1
: