Target
Ras-related C3 botulinum toxin substrate 1
Ligand
BDBM54624
Substrate
Meas. Tech.
Pyrazoline SAR compounds tested via Multiplex dose response to identify specific small molecule inhibitors of Ras and Ras-related GTPases specifically Rac1 activated mutant
Ki
3260±n/a nM
Citation
 PubChem, PC Pyrazoline SAR compounds tested via Multiplex dose response to identify specific small molecule inhibitors of Ras and Ras-related GTPases specifically Rac1 activated mutant PubChem Bioassay (2009)[AID] 
Target
Name:
Ras-related C3 botulinum toxin substrate 1
Synonyms:
RAC1_MOUSE Rac1 protein
Type:
PROTEIN
Mol. Mass.:
21455.91
Organism:
Mus musculus
Description:
EBI_101485
Residue:
192
  
Inhibitor
Name:
BDBM54624
Synonyms:
1-(4-chlorophenyl)-5-(2-fluorophenyl)-3-(4-methoxyphenyl)-2-pyrazoline UNM-0000305863 | cid_2883132
Type:
Small organic molecule
Emp. Form.:
C22H18ClFN2O
Mol. Mass.:
380.843
SMILES:
COc1ccc(cc1)C1=NN(C(C1)c1ccccc1F)c1ccc(Cl)cc1
: