Target
GTPase KRas [1-37]
Ligand
BDBM54596
Substrate
Meas. Tech.
Pyrazoline SAR compounds tested via Multiplex dose response to identify specific small molecule inhibitors of Ras and Ras-related GTPases specifically Ras activated mutant
EC50
30000±n/a nM
Citation
 PubChem, PC Pyrazoline SAR compounds tested via Multiplex dose response to identify specific small molecule inhibitors of Ras and Ras-related GTPases specifically Ras activated mutant PubChem Bioassay (2009)[AID] 
Target
Name:
GTPase KRas [1-37]
Synonyms:
ras protein
Type:
Enzyme Catalytic Domain
Mol. Mass.:
4034.04
Organism:
Homo sapiens (Human)
Description:
gi_190938
Residue:
37
  
Inhibitor
Name:
BDBM54596
Synonyms:
UNM-0000305834 sodium;4-(3,5-diphenyl-2-pyrazolin-1-yl)besylate | sodium;4-(3,5-diphenyl-3,4-dihydropyrazol-2-yl)benzenesulfonate
Type:
Small organic molecule
Emp. Form.:
C21H17N2O3S
Mol. Mass.:
377.437
SMILES:
[O-]S(=O)(=O)c1ccc(cc1)N1N=C(CC1c1ccccc1)c1ccccc1
: