Target
GTPase KRas [1-37]
Ligand
BDBM54652
Substrate
Meas. Tech.
Pyrazoline SAR compounds tested via Multiplex dose response to identify specific small molecule inhibitors of Ras and Ras-related GTPases specifically Ras activated mutant
EC50
30000±n/a nM
Citation
 PubChem, PC Pyrazoline SAR compounds tested via Multiplex dose response to identify specific small molecule inhibitors of Ras and Ras-related GTPases specifically Ras activated mutant PubChem Bioassay (2009)[AID] 
Target
Name:
GTPase KRas [1-37]
Synonyms:
ras protein
Type:
Enzyme Catalytic Domain
Mol. Mass.:
4034.04
Organism:
Homo sapiens (Human)
Description:
gi_190938
Residue:
37
  
Inhibitor
Name:
BDBM54652
Synonyms:
4-[3-(3-bromophenyl)-5-phenyl-3,4-dihydropyrazol-2-yl]benzenesulfonamide KUC103428N cid_44143703
Type:
Small organic molecule
Emp. Form.:
C21H18BrN3O2S
Mol. Mass.:
456.356
SMILES:
NS(=O)(=O)c1ccc(cc1)N1N=C(CC1c1cccc(Br)c1)c1ccccc1
: