Target
Ras-related C3 botulinum toxin substrate 1
Ligand
BDBM54554
Substrate
Meas. Tech.
Oxadiazole SAR compounds tested via Multiplex dose response to identify specific small molecule inhibitors of Ras and Ras-related GTPases specifically Rac1 activated mutant
EC50
1368±n/a nM
Citation
 PubChem, PC Oxadiazole SAR compounds tested via Multiplex dose response to identify specific small molecule inhibitors of Ras and Ras-related GTPases specifically Rac1 activated mutant PubChem Bioassay (2009)[AID] 
Target
Name:
Ras-related C3 botulinum toxin substrate 1
Synonyms:
RAC1_MOUSE Rac1 protein
Type:
PROTEIN
Mol. Mass.:
21455.91
Organism:
Mus musculus
Description:
EBI_101485
Residue:
192
  
Inhibitor
Name:
BDBM54554
Synonyms:
3-[3-(2-chlorophenyl)-1,2,4-oxadiazol-5-yl]-1-[4-(2,5-dimethylphenyl)-1-piperazinyl]-1-propanone 3-[3-(2-chlorophenyl)-1,2,4-oxadiazol-5-yl]-1-[4-(2,5-dimethylphenyl)piperazino]propan-1-one UNM-0000306075 | cid_42596903
Type:
Small organic molecule
Emp. Form.:
C23H25ClN4O2
Mol. Mass.:
424.923
SMILES:
Cc1ccc(C)c(c1)N1CCN(CC1)C(=O)CCc1nc(no1)-c1ccccc1Cl
: