Target
Ras-related C3 botulinum toxin substrate 1
Ligand
BDBM54569
Substrate
Meas. Tech.
Oxadiazole SAR compounds tested via Multiplex dose response to identify specific small molecule inhibitors of Ras and Ras-related GTPases specifically Rac1 activated mutant
EC50
1476±n/a nM
Citation
 PubChem, PC Oxadiazole SAR compounds tested via Multiplex dose response to identify specific small molecule inhibitors of Ras and Ras-related GTPases specifically Rac1 activated mutant PubChem Bioassay (2009)[AID] 
Target
Name:
Ras-related C3 botulinum toxin substrate 1
Synonyms:
RAC1_MOUSE Rac1 protein
Type:
PROTEIN
Mol. Mass.:
21455.91
Organism:
Mus musculus
Description:
EBI_101485
Residue:
192
  
Inhibitor
Name:
BDBM54569
Synonyms:
3-[3-(4-methoxyphenyl)-1,2,4-oxadiazol-5-yl]-1-[4-(2-methylphenyl)-1-piperazinyl]-1-propanone 3-[3-(4-methoxyphenyl)-1,2,4-oxadiazol-5-yl]-1-[4-(o-tolyl)piperazino]propan-1-one UNM-0000306090 | cid_42608817
Type:
Small organic molecule
Emp. Form.:
C23H26N4O3
Mol. Mass.:
406.4775
SMILES:
COc1ccc(cc1)-c1noc(CCC(=O)N2CCN(CC2)c2ccccc2C)n1
: