Target
Ras-related C3 botulinum toxin substrate 1
Ligand
BDBM54549
Substrate
Meas. Tech.
Oxadiazole SAR compounds tested via Multiplex dose response to identify specific small molecule inhibitors of Ras and Ras-related GTPases specifically Rac1 activated mutant
Ki
250±n/a nM
Citation
 PubChem, PC Oxadiazole SAR compounds tested via Multiplex dose response to identify specific small molecule inhibitors of Ras and Ras-related GTPases specifically Rac1 activated mutant PubChem Bioassay (2009)[AID] 
Target
Name:
Ras-related C3 botulinum toxin substrate 1
Synonyms:
RAC1_MOUSE Rac1 protein
Type:
PROTEIN
Mol. Mass.:
21455.91
Organism:
Mus musculus
Description:
EBI_101485
Residue:
192
  
Inhibitor
Name:
BDBM54549
Synonyms:
1-[4-(2,5-dimethylphenyl)-1-piperazinyl]-3-(3-phenyl-1,2,4-oxadiazol-5-yl)-1-propanone 1-[4-(2,5-dimethylphenyl)piperazino]-3-(3-phenyl-1,2,4-oxadiazol-5-yl)propan-1-one UNM-0000306070 | cid_25241706
Type:
Small organic molecule
Emp. Form.:
C23H26N4O2
Mol. Mass.:
390.4781
SMILES:
Cc1ccc(C)c(c1)N1CCN(CC1)C(=O)CCc1nc(no1)-c1ccccc1
: