Target
GTPase KRas [1-37]
Ligand
BDBM54557
Substrate
Meas. Tech.
Oxadiazole SAR compounds tested via Multiplex dose response to identify specific small molecule inhibitors of Ras and Ras-related GTPases specifically Ras wildtype
EC50
30000±n/a nM
Citation
 PubChem, PC Oxadiazole SAR compounds tested via Multiplex dose response to identify specific small molecule inhibitors of Ras and Ras-related GTPases specifically Ras wildtype PubChem Bioassay (2009)[AID] 
Target
Name:
GTPase KRas [1-37]
Synonyms:
ras protein
Type:
Enzyme Catalytic Domain
Mol. Mass.:
4034.04
Organism:
Homo sapiens (Human)
Description:
gi_190938
Residue:
37
  
Inhibitor
Name:
BDBM54557
Synonyms:
1-[4-(2,5-dimethylphenyl)-1-piperazinyl]-3-[3-(2-methylphenyl)-1,2,4-oxadiazol-5-yl]-1-propanone 1-[4-(2,5-dimethylphenyl)piperazino]-3-[3-(o-tolyl)-1,2,4-oxadiazol-5-yl]propan-1-one UNM-0000306078 | cid_42596906
Type:
Small organic molecule
Emp. Form.:
C24H28N4O2
Mol. Mass.:
404.5047
SMILES:
Cc1ccc(C)c(c1)N1CCN(CC1)C(=O)CCc1nc(no1)-c1ccccc1C
: