Target
4-hydroxy-2-oxoglutarate aldolase, mitochondrial
Ligand
BDBM267943
Substrate
Meas. Tech.
Fluorescence based hOGA assay
pH
7±n/a
Temperature
298.15±n/a K
Ki
3.30±n/a nM
Comments
extracted
Citation
 Kaul, RMcEachern, EJVocadlo, DJZhou, YLiu, KSelnick, HGWei, ZMu, CWang, YWang, X Selective glycosidase inhibitors and uses thereof US Patent  US9718854 Publication Date 8/1/2017 
Target
Name:
4-hydroxy-2-oxoglutarate aldolase, mitochondrial
Synonyms:
2-keto-4-hydroxyglutarate aldolase C10orf65 DHDPSL HOGA1 Probable KHG-aldolase | Protein 569272
Type:
PROTEIN
Mol. Mass.:
35253.21
Organism:
Homo sapiens (Human)
Description:
ChEMBL_461876
Residue:
327
  
Inhibitor
Name:
BDBM267943
Synonyms:
(3aR,5R,6S,7R,7aR)-5-(((2- methoxyethyl)amino)methyl)-2- (methylamino)-5,6,7,7a-tetrahydro- 3aH-pyrano[3,2-d]thiazole-6,7-diol | US9718854, 29
Type:
Small organic molecule
Emp. Form.:
C11H21N3O4S
Mol. Mass.:
291.367
SMILES:
CNC1=N[C@H]2[C@H](O[C@H](CNCCOC)[C@@H](O)[C@@H]2O)S1
: