Target
Ras-related C3 botulinum toxin substrate 1
Ligand
BDBM54593
Substrate
Meas. Tech.
Pyrazoline SAR compounds tested via Multiplex dose response to identify specific small molecule inhibitors of Ras and Ras-related GTPases specifically Rac1 wildtype
EC50
30000±n/a nM
Citation
 PubChem, PC Pyrazoline SAR compounds tested via Multiplex dose response to identify specific small molecule inhibitors of Ras and Ras-related GTPases specifically Rac1 wildtype PubChem Bioassay (2009)[AID] 
Target
Name:
Ras-related C3 botulinum toxin substrate 1
Synonyms:
RAC1_MOUSE Rac1 protein
Type:
PROTEIN
Mol. Mass.:
21455.91
Organism:
Mus musculus
Description:
EBI_101485
Residue:
192
  
Inhibitor
Name:
BDBM54593
Synonyms:
1,3-bis(4-bromophenyl)-5-(2-fluorophenyl)-2-pyrazoline UNM-0000305831 | cid_2830687
Type:
Small organic molecule
Emp. Form.:
C21H15Br2FN2
Mol. Mass.:
474.164
SMILES:
Fc1ccccc1C1CC(=NN1c1ccc(Br)cc1)c1ccc(Br)cc1
: