Target
Ras-related C3 botulinum toxin substrate 1
Ligand
BDBM54595
Substrate
Meas. Tech.
Pyrazoline SAR compounds tested via Multiplex dose response to identify specific small molecule inhibitors of Ras and Ras-related GTPases specifically Rac1 wildtype
EC50
30000±n/a nM
Citation
 PubChem, PC Pyrazoline SAR compounds tested via Multiplex dose response to identify specific small molecule inhibitors of Ras and Ras-related GTPases specifically Rac1 wildtype PubChem Bioassay (2009)[AID] 
Target
Name:
Ras-related C3 botulinum toxin substrate 1
Synonyms:
RAC1_MOUSE Rac1 protein
Type:
PROTEIN
Mol. Mass.:
21455.91
Organism:
Mus musculus
Description:
EBI_101485
Residue:
192
  
Inhibitor
Name:
BDBM54595
Synonyms:
3-(4-chlorophenyl)-5-(4-methoxyphenyl)-2-phenyl-3,4-dihydropyrazole UNM-0000305833 | cid_2802444
Type:
Small organic molecule
Emp. Form.:
C22H19ClN2O
Mol. Mass.:
362.852
SMILES:
COc1ccc(cc1)C1=NN(C(C1)c1ccc(Cl)cc1)c1ccccc1
: