Target
Ras-related C3 botulinum toxin substrate 1
Ligand
BDBM54611
Substrate
Meas. Tech.
Pyrazoline SAR compounds tested via Multiplex dose response to identify specific small molecule inhibitors of Ras and Ras-related GTPases specifically Rac1 wildtype
EC50
30000±n/a nM
Citation
 PubChem, PC Pyrazoline SAR compounds tested via Multiplex dose response to identify specific small molecule inhibitors of Ras and Ras-related GTPases specifically Rac1 wildtype PubChem Bioassay (2009)[AID] 
Target
Name:
Ras-related C3 botulinum toxin substrate 1
Synonyms:
RAC1_MOUSE Rac1 protein
Type:
PROTEIN
Mol. Mass.:
21455.91
Organism:
Mus musculus
Description:
EBI_101485
Residue:
192
  
Inhibitor
Name:
BDBM54611
Synonyms:
4-[3-(4-ethylphenyl)-5-(4-fluorophenyl)-2-pyrazolin-1-yl]benzenesulfonamide UNM-0000305849 | cid_2864686
Type:
Small organic molecule
Emp. Form.:
C23H22FN3O2S
Mol. Mass.:
423.503
SMILES:
CCc1ccc(cc1)C1=NN(C(C1)c1ccc(F)cc1)c1ccc(cc1)S(N)(=O)=O
: