Target
Ras-related C3 botulinum toxin substrate 1
Ligand
BDBM54612
Substrate
Meas. Tech.
Pyrazoline SAR compounds tested via Multiplex dose response to identify specific small molecule inhibitors of Ras and Ras-related GTPases specifically Rac1 wildtype
EC50
30000±n/a nM
Citation
 PubChem, PC Pyrazoline SAR compounds tested via Multiplex dose response to identify specific small molecule inhibitors of Ras and Ras-related GTPases specifically Rac1 wildtype PubChem Bioassay (2009)[AID] 
Target
Name:
Ras-related C3 botulinum toxin substrate 1
Synonyms:
RAC1_MOUSE Rac1 protein
Type:
PROTEIN
Mol. Mass.:
21455.91
Organism:
Mus musculus
Description:
EBI_101485
Residue:
192
  
Inhibitor
Name:
BDBM54612
Synonyms:
2-[4-[bis(fluoranyl)methylsulfonyl]phenyl]-5-(4-bromophenyl)-3-phenyl-3,4-dihydropyrazole 5-(4-bromophenyl)-2-[4-(difluoromethylsulfonyl)phenyl]-3-phenyl-3,4-dihydropyrazole cid_2865099
Type:
Small organic molecule
Emp. Form.:
C22H17BrF2N2O2S
Mol. Mass.:
491.348
SMILES:
FC(F)S(=O)(=O)c1ccc(cc1)N1N=C(CC1c1ccccc1)c1ccc(Br)cc1
: