Target
Tyrosine-protein phosphatase non-receptor type 7
Ligand
BDBM31736
Substrate
Meas. Tech.
MOA HePTP Fluorescent secondary assay for identification of redox-state modulating compounds
IC50
4130±n/a nM
Citation
 PubChem, PC MOA HePTP Fluorescent secondary assay for identification of redox-state modulating compounds PubChem Bioassay (2009)[AID] 
Target
Name:
Tyrosine-protein phosphatase non-receptor type 7
Synonyms:
He-PTP Hematopoietic protein-tyrosine phosphatase (HEPTP) PTPN7 Tyrosine-protein phosphatase non-receptor type 7 | Tyrosine-protein phosphatase non-receptor type 7 (HEPTP)
Type:
Protein
Mol. Mass.:
40530.79
Organism:
Homo sapiens (Human)
Description:
P35236
Residue:
360
  
Inhibitor
Name:
BDBM31736
Synonyms:
(7Z)-3-bromanyl-7-[[5-(2-nitrophenyl)furan-2-yl]methylidene]-[1,3]thiazolo[4,5]imidazo[1,2-b]pyridin-8-one (7Z)-3-bromo-7-[[5-(2-nitrophenyl)-2-furyl]methylene]thiazolo[4,5]imidazo[1,2-b]pyridin-8-one MLS-0091942.0001 | cid_5341934
Type:
Small organic molecule
Emp. Form.:
C19H9BrN4O4S
Mol. Mass.:
469.268
SMILES:
[O-][N+](=O)c1ccccc1-c1ccc(\C=c2/sc3nc4cc(Br)cnc4n3c2=O)o1
: