Target
Tyrosine-protein phosphatase non-receptor type 7
Ligand
BDBM46197
Substrate
Meas. Tech.
MOA HePTP Fluorescent secondary assay for identification of redox-state modulating compounds
IC50
1540±n/a nM
Citation
 PubChem, PC MOA HePTP Fluorescent secondary assay for identification of redox-state modulating compounds PubChem Bioassay (2009)[AID] 
Target
Name:
Tyrosine-protein phosphatase non-receptor type 7
Synonyms:
He-PTP Hematopoietic protein-tyrosine phosphatase (HEPTP) PTPN7 Tyrosine-protein phosphatase non-receptor type 7 | Tyrosine-protein phosphatase non-receptor type 7 (HEPTP)
Type:
Protein
Mol. Mass.:
40530.79
Organism:
Homo sapiens (Human)
Description:
P35236
Residue:
360
  
Inhibitor
Name:
BDBM46197
Synonyms:
1-[2,3-bis(2-furanyl)-6-quinoxalinyl]-3-(phenylmethyl)urea 1-benzyl-3-[2,3-bis(2-furyl)quinoxalin-6-yl]urea MLS-0292135.0001 | cid_24178232
Type:
Small organic molecule
Emp. Form.:
C24H18N4O3
Mol. Mass.:
410.4247
SMILES:
O=C(NCc1ccccc1)Nc1ccc2nc(-c3ccco3)c(nc2c1)-c1ccco1
: