Target
Tyrosine-protein phosphatase non-receptor type 7
Ligand
BDBM46200
Substrate
Meas. Tech.
MOA HePTP Fluorescent secondary assay for identification of redox-state modulating compounds
IC50
1010±n/a nM
Citation
 PubChem, PC MOA HePTP Fluorescent secondary assay for identification of redox-state modulating compounds PubChem Bioassay (2009)[AID] 
Target
Name:
Tyrosine-protein phosphatase non-receptor type 7
Synonyms:
He-PTP Hematopoietic protein-tyrosine phosphatase (HEPTP) PTPN7 Tyrosine-protein phosphatase non-receptor type 7 | Tyrosine-protein phosphatase non-receptor type 7 (HEPTP)
Type:
Protein
Mol. Mass.:
40530.79
Organism:
Homo sapiens (Human)
Description:
P35236
Residue:
360
  
Inhibitor
Name:
BDBM46200
Synonyms:
1-[2,3-bis(2-furanyl)-6-quinoxalinyl]-3-propylurea 1-[2,3-bis(furan-2-yl)quinoxalin-6-yl]-3-propyl-urea MLS-0292138.0001 | cid_24178235
Type:
Small organic molecule
Emp. Form.:
C20H18N4O3
Mol. Mass.:
362.3819
SMILES:
CCCNC(=O)Nc1ccc2nc(-c3ccco3)c(nc2c1)-c1ccco1
: