Target
Tyrosine-protein phosphatase non-receptor type 7
Ligand
BDBM46202
Substrate
Meas. Tech.
MOA HePTP Fluorescent secondary assay for identification of redox-state modulating compounds
IC50
683±n/a nM
Citation
 PubChem, PC MOA HePTP Fluorescent secondary assay for identification of redox-state modulating compounds PubChem Bioassay (2009)[AID] 
Target
Name:
Tyrosine-protein phosphatase non-receptor type 7
Synonyms:
He-PTP Hematopoietic protein-tyrosine phosphatase (HEPTP) PTPN7 Tyrosine-protein phosphatase non-receptor type 7 | Tyrosine-protein phosphatase non-receptor type 7 (HEPTP)
Type:
Protein
Mol. Mass.:
40530.79
Organism:
Homo sapiens (Human)
Description:
P35236
Residue:
360
  
Inhibitor
Name:
BDBM46202
Synonyms:
3-[[2,3-bis(2-furyl)quinoxalin-6-yl]carbamoylamino]propionic acid ethyl ester MLS-0292140.0001 ethyl 3-[[2,3-bis(furan-2-yl)quinoxalin-6-yl]carbamoylamino]propanoate
Type:
Small organic molecule
Emp. Form.:
C22H20N4O5
Mol. Mass.:
420.418
SMILES:
CCOC(=O)CCNC(=O)Nc1ccc2nc(-c3ccco3)c(nc2c1)-c1ccco1
: