Target
Tyrosine-protein phosphatase non-receptor type 7
Ligand
BDBM46203
Substrate
Meas. Tech.
MOA HePTP Fluorescent secondary assay for identification of redox-state modulating compounds
IC50
34.5±n/a nM
Citation
 PubChem, PC MOA HePTP Fluorescent secondary assay for identification of redox-state modulating compounds PubChem Bioassay (2009)[AID] 
Target
Name:
Tyrosine-protein phosphatase non-receptor type 7
Synonyms:
He-PTP Hematopoietic protein-tyrosine phosphatase (HEPTP) PTPN7 Tyrosine-protein phosphatase non-receptor type 7 | Tyrosine-protein phosphatase non-receptor type 7 (HEPTP)
Type:
Protein
Mol. Mass.:
40530.79
Organism:
Homo sapiens (Human)
Description:
P35236
Residue:
360
  
Inhibitor
Name:
BDBM46203
Synonyms:
1-(2,6-dichlorophenyl)-3-(2-phenylethyl)thiourea 1-[2,6-bis(chloranyl)phenyl]-3-(2-phenylethyl)thiourea cid_2826665
Type:
Small organic molecule
Emp. Form.:
C15H14Cl2N2S
Mol. Mass.:
325.256
SMILES:
Clc1cccc(Cl)c1NC(=S)NCCc1ccccc1
: