Target
Tyrosine-protein phosphatase non-receptor type 7
Ligand
BDBM46206
Substrate
Meas. Tech.
MOA HePTP Fluorescent secondary assay for identification of redox-state modulating compounds
IC50
129±n/a nM
Citation
 PubChem, PC MOA HePTP Fluorescent secondary assay for identification of redox-state modulating compounds PubChem Bioassay (2009)[AID] 
Target
Name:
Tyrosine-protein phosphatase non-receptor type 7
Synonyms:
He-PTP Hematopoietic protein-tyrosine phosphatase (HEPTP) PTPN7 Tyrosine-protein phosphatase non-receptor type 7 | Tyrosine-protein phosphatase non-receptor type 7 (HEPTP)
Type:
Protein
Mol. Mass.:
40530.79
Organism:
Homo sapiens (Human)
Description:
P35236
Residue:
360
  
Inhibitor
Name:
BDBM46206
Synonyms:
MLS-0109562.0001 [1-(2-phenoxyethyl)indol-3-yl]-pyrrolidin-1-yl-methanethione [1-(2-phenoxyethyl)indol-3-yl]-pyrrolidino-methanethione | cid_1324805
Type:
Small organic molecule
Emp. Form.:
C21H22N2OS
Mol. Mass.:
350.477
SMILES:
S=C(N1CCCC1)c1cn(CCOc2ccccc2)c2ccccc12
: